Reaction Details
TargetSteroid hormone receptor ERR1
LigandBDBM20607
Substrate/Competitorn/a
Meas. Tech.ChEMBL_940752 (CHEMBL2330132)
IC50 200±n/a nM
Citation Jiang, XRWang, PSmith, CLZhu, BT Synthesis of novel estrogen receptor antagonists using metal-catalyzed coupling reactions and characterization of their biological activity. J Med Chem56:2779-90 (2013) 
 
Steroid hormone receptor ERR1
Name:Steroid hormone receptor ERR1
Type:PROTEIN
Mol. Mass.:45508.08
Organism:Homo sapiens (Human)
Description:ChEMBL_1499891
Residue:423
BDBM20607
NameBDBM20607
Synonyms:(2-{4-[(1Z)-1,2-diphenylbut-1-en-1-yl]phenoxy}ethyl)dimethylamine CHEMBL83 NCGC00024928 Tamoxifen Tamoxifen, 7 med.21724, Compound Tamoxifen
TypeSmall organic molecule
Emp. Form.C26H29NO
Mol. Mass.371.5146
SMILESCC\C(=C(/c1ccccc1)c1ccc(OCCN(C)C)cc1)c1ccccc1