Reaction Details
TargetIsoform 1 of Steroid hormone receptor ERR2 (ERRbeta2-delta10)
LigandBDBM50427838
Substrate/Competitorn/a
Meas. Tech.ChEMBL_940755 (CHEMBL2330135)
IC50 185±n/a nM
Citation Jiang, XRWang, PSmith, CLZhu, BT Synthesis of novel estrogen receptor antagonists using metal-catalyzed coupling reactions and characterization of their biological activity. J Med Chem56:2779-90 (2013) 
 
Isoform 1 of Steroid hormone receptor ERR2 (ERRbeta2-delta10)
Name:Isoform 1 of Steroid hormone receptor ERR2 (ERRbeta2-delta10)
Type:PROTEIN
Mol. Mass.:56220.72
Organism:Homo sapiens (Human)
Description:ChEMBL_940755
Residue:508
BDBM50427838
NameBDBM50427838
Synonyms:CHEMBL2326076
TypeSmall organic molecule
Emp. Form.C35H42O5
Mol. Mass.542.705
SMILESCCOC(=O)CC(=O)c1ccc(cc1)C#CCCCC[C@@H]1Cc2cc(O)ccc2[C@H]2CC[C@]3(C)[C@@H](O)CC[C@H]3[C@H]12