Reaction Details
TargetIsoform 1 of Steroid hormone receptor ERR2 (ERRbeta2-delta10)
LigandBDBM50427840
Substrate/Competitorn/a
Meas. Tech.ChEMBL_940755 (CHEMBL2330135)
IC50 331±n/a nM
Citation Jiang, XRWang, PSmith, CLZhu, BT Synthesis of novel estrogen receptor antagonists using metal-catalyzed coupling reactions and characterization of their biological activity. J Med Chem56:2779-90 (2013) 
 
Isoform 1 of Steroid hormone receptor ERR2 (ERRbeta2-delta10)
Name:Isoform 1 of Steroid hormone receptor ERR2 (ERRbeta2-delta10)
Type:PROTEIN
Mol. Mass.:56220.72
Organism:Homo sapiens (Human)
Description:ChEMBL_940755
Residue:508
BDBM50427840
NameBDBM50427840
Synonyms:CHEMBL2326074
TypeSmall organic molecule
Emp. Form.C33H37NO3
Mol. Mass.495.6518
SMILESC[C@]12CC[C@H]3[C@H]([C@@H]1CC[C@@H]2O)[C@H](CCCCC#Cc1ccc(cc1)-c1ccno1)Cc1cc(O)ccc31