Reaction Details
TargetIsoform 1 of Steroid hormone receptor ERR2 (ERRbeta2-delta10)
LigandBDBM50427842
Substrate/Competitorn/a
Meas. Tech.ChEMBL_940755 (CHEMBL2330135)
IC50 19±n/a nM
Citation Jiang, XRWang, PSmith, CLZhu, BT Synthesis of novel estrogen receptor antagonists using metal-catalyzed coupling reactions and characterization of their biological activity. J Med Chem56:2779-90 (2013) 
 
Isoform 1 of Steroid hormone receptor ERR2 (ERRbeta2-delta10)
Name:Isoform 1 of Steroid hormone receptor ERR2 (ERRbeta2-delta10)
Type:PROTEIN
Mol. Mass.:56220.72
Organism:Homo sapiens (Human)
Description:ChEMBL_940755
Residue:508
BDBM50427842
NameBDBM50427842
Synonyms:CHEMBL2326072
TypeSmall organic molecule
Emp. Form.C34H39NO2
Mol. Mass.493.679
SMILESC[C@]12CC[C@H]3[C@H]([C@@H]1CC[C@@H]2O)[C@H](CCCCC#Cc1ccc(cc1)-n1cccc1)Cc1cc(O)ccc31