Reaction Details
TargetArginase-2, mitochondrial
LigandBDBM50427904
Substrate/Competitorn/a
Meas. Tech.ChEMBL_940978 (CHEMBL2330668)
IC50 320±n/a nM
Citation Van Zandt, MCWhitehouse, DLGolebiowski, AJi, MKZhang, MBeckett, RPJagdmann, GERyder, TRSheeler, RAndreoli, MConway, BMahboubi, KD'Angelo, GMitschler, ACousido-Siah, ARuiz, FXHoward, EIPodjarny, ADSchroeter, H Discovery of (R)-2-amino-6-borono-2-(2-(piperidin-1-yl)ethyl)hexanoic acid and congeners as highly potent inhibitors of human arginases I and II for treatment of myocardial reperfusion injury. J Med Chem56:2568-80 (2013) 
 
Arginase-2, mitochondrial
Name:Arginase-2, mitochondrial
Type:PROTEIN
Mol. Mass.:38576.93
Organism:Homo sapiens (Human)
Description:ChEMBL_978892
Residue:354
BDBM50427904
NameBDBM50427904
Synonyms:CHEMBL2326086
TypeSmall organic molecule
Emp. Form.C12H27BN2O4
Mol. Mass.274.165
SMILESCCCN(C)CC[C@](N)(CCCCB(O)O)C(O)=O