Reaction Details
TargetArginase-2, mitochondrial
LigandBDBM50427909
Substrate/Competitorn/a
Meas. Tech.ChEMBL_940978 (CHEMBL2330668)
IC50 340±n/a nM
Citation Van Zandt, MCWhitehouse, DLGolebiowski, AJi, MKZhang, MBeckett, RPJagdmann, GERyder, TRSheeler, RAndreoli, MConway, BMahboubi, KD'Angelo, GMitschler, ACousido-Siah, ARuiz, FXHoward, EIPodjarny, ADSchroeter, H Discovery of (R)-2-amino-6-borono-2-(2-(piperidin-1-yl)ethyl)hexanoic acid and congeners as highly potent inhibitors of human arginases I and II for treatment of myocardial reperfusion injury. J Med Chem56:2568-80 (2013) 
 
Arginase-2, mitochondrial
Name:Arginase-2, mitochondrial
Type:PROTEIN
Mol. Mass.:38576.93
Organism:Homo sapiens (Human)
Description:ChEMBL_978892
Residue:354
BDBM50427909
NameBDBM50427909
Synonyms:CHEMBL2326097
TypeSmall organic molecule
Emp. Form.C14H29BN2O5
Mol. Mass.316.201
SMILESCOC[C@@H]1CCCN1CC[C@](N)(CCCCB(O)O)C(O)=O