Reaction Details
TargetEphrin type-A receptor 6
LigandBDBM50428059
Substrate/Competitorn/a
Meas. Tech.ChEMBL_941281 (CHEMBL2329871)
IC50 2100±n/a nM
Citation Incerti, MTognolini, MRusso, SPala, DGiorgio, CHassan-Mohamed, INoberini, RPasquale, EBVicini, PPiersanti, SRivara, SBarocelli, EMor, MLodola, A Amino acid conjugates of lithocholic acid as antagonists of the EphA2 receptor. J Med Chem56:2936-47 (2013) 
 
Ephrin type-A receptor 6
Name:Ephrin type-A receptor 6
Type:PROTEIN
Mol. Mass.:116385.76
Organism:Homo sapiens (Human)
Description:ChEMBL_774228
Residue:1036
BDBM50428059
NameBDBM50428059
Synonyms:CHEMBL2322989
TypeSmall organic molecule
Emp. Form.C35H50N2O4
Mol. Mass.562.7825
SMILESC[C@H](CCC(=O)N[C@@H](Cc1c[nH]c2ccccc12)C(O)=O)[C@H]1CC[C@H]2[C@@H]3CC[C@@H]4C[C@H](O)CC[C@]4(C)[C@H]3CC[C@]12C