Reaction Details
TargetIndoleamine 2,3-dioxygenase 1
LigandBDBM24656
Substrate/Competitorn/a
Meas. Tech.ChEMBL_941535 (CHEMBL2330526)
IC50 70300±n/a nM
Citation Pasceri, RSiegel, DRoss, DMoody, CJ Aminophenoxazinones as inhibitors of indoleamine 2,3-dioxygenase (IDO). Synthesis of exfoliazone and chandrananimycin A. J Med Chem56:3310-7 (2013) 
 
Indoleamine 2,3-dioxygenase 1
Name:Indoleamine 2,3-dioxygenase 1
Type:Enzyme
Mol. Mass.:45330.80
Organism:Homo sapiens (Human)
Description:P14902
Residue:403
BDBM24656
NameBDBM24656
Synonyms:4-PIM 4-phenyl-1H-imidazole CHEMBL14145 US9144538, 4-Phenylimidazole
TypeSmall organic molecule
Emp. Form.C9H8N2
Mol. Mass.144.1732
SMILESc1nc(c[nH]1)-c1ccccc1