Reaction Details
TargetCannabinoid receptor 2
LigandBDBM50428092
Substrate/Competitorn/a
Meas. Tech.ChEMBL_943907 (CHEMBL2339468)
EC50 170±n/a nM
Citation Rempel, VFuchs, AHinz, SKarcz, TLehr, MKoetter, UMüller, CE Magnolia Extract, Magnolol, and Metabolites: Activation of Cannabinoid CB2 Receptors and Blockade of the Related GPR55. ACS Med Chem Lett4:41-5 (2013) 
 
Cannabinoid receptor 2
Name:Cannabinoid receptor 2
Type:G Protein-Coupled Receptor (GPCR)
Mol. Mass.:39690.94
Organism:Homo sapiens (Human)
Description:P34972
Residue:360
BDBM50428092
NameBDBM50428092
Synonyms:CHEMBL32362 | tetrahydro-magnolol
TypeSmall organic molecule
Emp. Form.C18H22O2
Mol. Mass.270.3661
SMILESCCCc1ccc(O)c(c1)-c1cc(CCC)ccc1O