Reaction Details
TargetATP-dependent translocase ABCB1
LigandBDBM50428346
Substrate/Competitorn/a
Meas. Tech.ChEMBL_947408 (CHEMBL2345057)
IC50 10900±n/a nM
Citation Ochoa-Puentes, CBauer, SKühnle, MBernhardt, GBuschauer, AKönig, B Benzanilide-Biphenyl Replacement: A Bioisosteric Approach to Quinoline Carboxamide-Type ABCG2 Modulators. ACS Med Chem Lett4:393-6 (2013) 
 
ATP-dependent translocase ABCB1
Name:ATP-dependent translocase ABCB1
Type:Protein
Mol. Mass.:141503.50
Organism:Homo sapiens (Human)
Description:P08183
Residue:1280
BDBM50428346
NameBDBM50428346
Synonyms:CHEMBL2331718
TypeSmall organic molecule
Emp. Form.C36H33N3O5
Mol. Mass.587.6643
SMILESCOC(=O)c1ccc(cc1NC(=O)c1ccc2ncccc2c1)-c1ccc(CN2CCc3cc(OC)c(OC)cc3C2)cc1