Reaction Details
TargetATP-dependent translocase ABCB1
LigandBDBM50428347
Substrate/Competitorn/a
Meas. Tech.ChEMBL_947408 (CHEMBL2345057)
IC50 5990±n/a nM
Citation Ochoa-Puentes, CBauer, SKühnle, MBernhardt, GBuschauer, AKönig, B Benzanilide-Biphenyl Replacement: A Bioisosteric Approach to Quinoline Carboxamide-Type ABCG2 Modulators. ACS Med Chem Lett4:393-6 (2013) 
 
ATP-dependent translocase ABCB1
Name:ATP-dependent translocase ABCB1
Type:Protein
Mol. Mass.:141503.50
Organism:Homo sapiens (Human)
Description:P08183
Residue:1280
BDBM50428347
NameBDBM50428347
Synonyms:CHEMBL2331716
TypeSmall organic molecule
Emp. Form.C49H59N3O11
Mol. Mass.866.0063
SMILESCOCCOCCOCCOc1cc2CCN(CCc3ccc(cc3)-c3ccc(C(=O)OC)c(NC(=O)c4ccc5ccccc5n4)c3)Cc2cc1OCCOCCOCCOC