Reaction Details
TargetATP-dependent translocase ABCB1
LigandBDBM50206310
Substrate/Competitorn/a
Meas. Tech.ChEMBL_947408 (CHEMBL2345057)
IC50 193±n/a nM
Citation Ochoa-Puentes, CBauer, SKühnle, MBernhardt, GBuschauer, AKönig, B Benzanilide-Biphenyl Replacement: A Bioisosteric Approach to Quinoline Carboxamide-Type ABCG2 Modulators. ACS Med Chem Lett4:393-6 (2013) 
 
ATP-dependent translocase ABCB1
Name:ATP-dependent translocase ABCB1
Type:Protein
Mol. Mass.:141503.50
Organism:Homo sapiens (Human)
Description:P08183
Residue:1280
BDBM50206310
NameBDBM50206310
Synonyms:5-Methoxy-9-oxo-9,10-dihydro-acridine-4-carboxylic acid {4-[2-(6,7-dimethoxy-3,4-dihydro-1H-isoquinolin-2-yl)-ethyl]-phenyl}-amide ELACRIDAR HYDROCHLORIDE N-(4-(2-(6,7-dimethoxy-3,4-dihydroisoquinolin-2(1H)-yl)ethyl)phenyl)-5-methoxy-9-oxo-9,10-dihydroacridine-2-carboxamide N-4-[2-(1,2,3,4-Tetrahydro-6,7-dimethoxy-2-isoquinolinyl)ethyl]phenyl}-9,10-dihydro-5-methoxy-9-oxo-4-acridone carboxamide | US11739089, Compound Elacridar
TypeSmall organic molecule
Emp. Form.C34H33N3O5
Mol. Mass.563.6429
SMILESCOc1cc2CCN(CCc3ccc(NC(=O)c4cccc5c4[nH]c4c(OC)cccc4c5=O)cc3)Cc2cc1OC