Reaction Details
TargetMyelin transcription factor 1
LigandBDBM13216
Substrate/Competitorn/a
Meas. Tech.ChEMBL_942118 (CHEMBL2341274)
IC50 63±n/a nM
Citation Rohe, AGöllner, CWichapong, KErdmann, FAl-Mazaideh, GMSippl, WSchmidt, M Evaluation of potential Myt1 kinase inhibitors by TR-FRET based binding assay. Eur J Med Chem61:41-8 (2013) 
 
Myelin transcription factor 1
Name:Myelin transcription factor 1
Type:PROTEIN
Mol. Mass.:122258.96
Organism:Homo sapiens (Human)
Description:ChEMBL_942118
Residue:1121
BDBM13216
NameBDBM13216
Synonyms:BMS-354825 DASATINIB N-(2-chloro-6-methylphenyl)-2-({6-[4-(2-hydroxyethyl)piperazin-1-yl]-2-methylpyrimidin-4-yl}amino)-1,3-thiazole-5-carboxamide US20230348453, Compound A8 med.21724, Compound Dasatinib
TypeSmall organic molecule
Emp. Form.C22H26ClN7O2S
Mol. Mass.488.006
SMILESCc1nc(Nc2ncc(s2)C(=O)Nc2c(C)cccc2Cl)cc(n1)N1CCN(CCO)CC1