Reaction Details
TargetCarbonic anhydrase 2
LigandBDBM50339447
Substrate/Competitorn/a
Meas. Tech.ChEMBL_944558 (CHEMBL2339074)
Ki 11±n/a nM
Citation Winum, JYColinas, PASupuran, CT Glycosidic carbonic anhydrase IX inhibitors: a sweet approach against cancer. Bioorg Med Chem21:1419-26 (2013) 
 
Carbonic anhydrase 2
Name:Carbonic anhydrase 2
Type:Enzyme
Mol. Mass.:29250.71
Organism:Homo sapiens (Human)
Description:P00918
Residue:260
BDBM50339447
NameBDBM50339447
Synonyms:CHEMBL1688312 | Methyl 2,3,4-Tri-O-acetyl-6-sulfamoyl-alpha-D-glucopyranose
TypeSmall organic molecule
Emp. Form.C13H21NO11S
Mol. Mass.399.371
SMILESCO[C@H]1O[C@H](COS(N)(=O)=O)[C@@H](OC(C)=O)[C@H](OC(C)=O)[C@H]1OC(C)=O