Reaction Details
TargetcAMP-specific 3',5'-cyclic phosphodiesterase 4B
LigandBDBM50428913
Substrate/Competitorn/a
Meas. Tech.ChEMBL_946133 (CHEMBL2343535)
IC50 31000±n/a nM
Citation El-Elimat, TFigueroa, MRaja, HAGraf, TNAdcock, AFKroll, DJDay, CSWani, MCPearce, CJOberlies, NH Benzoquinones and terphenyl compounds as phosphodiesterase-4B inhibitors from a fungus of the order Chaetothyriales (MSX 47445). J Nat Prod76:382-7 (2013) 
 
cAMP-specific 3',5'-cyclic phosphodiesterase 4B
Name:cAMP-specific 3',5'-cyclic phosphodiesterase 4B
Type:Protein
Mol. Mass.:83318.87
Organism:Homo sapiens (Human)
Description:Q07343
Residue:736
BDBM50428913
NameBDBM50428913
Synonyms:CHEMBL2331810
TypeSmall organic molecule
Emp. Form.C19H16O3
Mol. Mass.292.3285
SMILESCOc1c(O)c(cc(O)c1-c1ccccc1)-c1ccccc1