Reaction Details
TargetD(1A) dopamine receptor
LigandBDBM50004923
Substrate/Competitorn/a
Meas. Tech.ChEMBL_942278 (CHEMBL2343276)
EC50 130±n/a nM
Citation Sun, HZhu, LYang, HQian, WGuo, LZhou, SGao, BLi, ZZhou, YJiang, HChen, KZhen, XLiu, H Asymmetric total synthesis and identification of tetrahydroprotoberberine derivatives as new antipsychotic agents possessing a dopamine D(1), D(2) and serotonin 5-HT(1A) multi-action profile. Bioorg Med Chem21:856-68 (2013) 
 
D(1A) dopamine receptor
Name:D(1A) dopamine receptor
Type:Enzyme
Mol. Mass.:49303.43
Organism:Homo sapiens (Human)
Description:P21728
Residue:446
BDBM50004923
NameBDBM50004923
Synonyms:(+/-)-SKF-38393 1-Phenyl-2,3,4,5-tetrahydro-1H-benzo[d]azepine-7,8-diol (SK&F 38393) 1-Phenyl-2,3,4,5-tetrahydro-1H-benzo[d]azepine-7,8-diol; hydrochloride(SKF 38393) CHEMBL505308 RS(+/-)SKF 383931-Phenyl-2,3,4,5-tetrahydro-1H-benzo[d]azepine-7,8-diol SK-38393 SKF-38393 cid_147514
TypeSmall organic molecule
Emp. Form.C16H17NO2
Mol. Mass.255.3117
SMILESOc1cc2CCNCC(c3ccccc3)c2cc1O