Reaction Details
TargetD(1A) dopamine receptor
LigandBDBM50429057
Substrate/Competitorn/a
Meas. Tech.ChEMBL_942282 (CHEMBL2343280)
Ki 4.5±n/a nM
Citation Sun, HZhu, LYang, HQian, WGuo, LZhou, SGao, BLi, ZZhou, YJiang, HChen, KZhen, XLiu, H Asymmetric total synthesis and identification of tetrahydroprotoberberine derivatives as new antipsychotic agents possessing a dopamine D(1), D(2) and serotonin 5-HT(1A) multi-action profile. Bioorg Med Chem21:856-68 (2013) 
 
D(1A) dopamine receptor
Name:D(1A) dopamine receptor
Type:Enzyme
Mol. Mass.:49303.43
Organism:Homo sapiens (Human)
Description:P21728
Residue:446
BDBM50429057
NameBDBM50429057
Synonyms:CHEMBL2334891
TypeSmall organic molecule
Emp. Form.C20H23NO4
Mol. Mass.341.4009
SMILESCOc1cc2CCN3Cc4c(C[C@H]3c2cc1O)ccc(OC)c4OC