Reaction Details
TargetBotulinum neurotoxin type A
LigandBDBM50429168
Substrate/Competitorn/a
Meas. Tech.ChEMBL_943587 (CHEMBL2343854)
Ki 760±n/a nM
Citation Šilhár, PSilvaggi, NRPellett, SCapková, KJohnson, EAAllen, KNJanda, KD Evaluation of adamantane hydroxamates as botulinum neurotoxin inhibitors: synthesis, crystallography, modeling, kinetic and cellular based studies. Bioorg Med Chem21:1344-8 (2013) 
 
Botulinum neurotoxin type A
Name:Botulinum neurotoxin type A
Type:PROTEIN
Mol. Mass.:149450.01
Organism:Clostridium botulinum
Description:ChEMBL_1510137
Residue:1296
BDBM50429168
NameBDBM50429168
Synonyms:CHEMBL2336720
TypeSmall organic molecule
Emp. Form.C37H46N4O4
Mol. Mass.610.7855
SMILESNCCCCCCCNC(=O)c1cc(CCC(=O)NO)c(CCC(O)(c2ccccc2)c2ccccc2)n1Cc1ccccc1