Reaction Details
TargetBotulinum neurotoxin type A
LigandBDBM50429169
Substrate/Competitorn/a
Meas. Tech.ChEMBL_943587 (CHEMBL2343854)
Ki 160±n/a nM
Citation Šilhár, PSilvaggi, NRPellett, SCapková, KJohnson, EAAllen, KNJanda, KD Evaluation of adamantane hydroxamates as botulinum neurotoxin inhibitors: synthesis, crystallography, modeling, kinetic and cellular based studies. Bioorg Med Chem21:1344-8 (2013) 
 
Botulinum neurotoxin type A
Name:Botulinum neurotoxin type A
Type:PROTEIN
Mol. Mass.:149450.01
Organism:Clostridium botulinum
Description:ChEMBL_1510137
Residue:1296
BDBM50429169
NameBDBM50429169
Synonyms:CHEMBL2336719
TypeSmall organic molecule
Emp. Form.C11H13Cl2NO3
Mol. Mass.278.132
SMILESOCC[C@H](CC(=O)NO)c1ccc(Cl)cc1Cl