Reaction Details
TargetBotulinum neurotoxin type A
LigandBDBM50429173
Substrate/Competitorn/a
Meas. Tech.ChEMBL_943587 (CHEMBL2343854)
Ki 750±n/a nM
Citation Šilhár, PSilvaggi, NRPellett, SCapková, KJohnson, EAAllen, KNJanda, KD Evaluation of adamantane hydroxamates as botulinum neurotoxin inhibitors: synthesis, crystallography, modeling, kinetic and cellular based studies. Bioorg Med Chem21:1344-8 (2013) 
 
Botulinum neurotoxin type A
Name:Botulinum neurotoxin type A
Type:PROTEIN
Mol. Mass.:149450.01
Organism:Clostridium botulinum
Description:ChEMBL_1510137
Residue:1296
BDBM50429173
NameBDBM50429173
Synonyms:CHEMBL2336709
TypeSmall organic molecule
Emp. Form.C18H23NO2
Mol. Mass.285.3807
SMILESONC(=O)CC12CC3CC(C1)CC(C3)(C2)c1ccccc1