Reaction Details
TargetBotulinum neurotoxin type A
LigandBDBM50429179
Substrate/Competitorn/a
Meas. Tech.ChEMBL_943588 (CHEMBL2343855)
IC50 1000±n/a nM
Citation Šilhár, PSilvaggi, NRPellett, SCapková, KJohnson, EAAllen, KNJanda, KD Evaluation of adamantane hydroxamates as botulinum neurotoxin inhibitors: synthesis, crystallography, modeling, kinetic and cellular based studies. Bioorg Med Chem21:1344-8 (2013) 
 
Botulinum neurotoxin type A
Name:Botulinum neurotoxin type A
Type:PROTEIN
Mol. Mass.:149450.01
Organism:Clostridium botulinum
Description:ChEMBL_1510137
Residue:1296
BDBM50429179
NameBDBM50429179
Synonyms:CHEMBL2336711
TypeSmall organic molecule
Emp. Form.C22H29NO2
Mol. Mass.339.4712
SMILESONC(=O)CC12CC3CC(C1)CC(C3)(C2)c1ccc2CCCCc2c1