Reaction Details
TargetBotulinum neurotoxin type A
LigandBDBM50429186
Substrate/Competitorn/a
Meas. Tech.ChEMBL_943588 (CHEMBL2343855)
IC50 24000±n/a nM
Citation Šilhár, PSilvaggi, NRPellett, SCapková, KJohnson, EAAllen, KNJanda, KD Evaluation of adamantane hydroxamates as botulinum neurotoxin inhibitors: synthesis, crystallography, modeling, kinetic and cellular based studies. Bioorg Med Chem21:1344-8 (2013) 
 
Botulinum neurotoxin type A
Name:Botulinum neurotoxin type A
Type:PROTEIN
Mol. Mass.:149450.01
Organism:Clostridium botulinum
Description:ChEMBL_1510137
Residue:1296
BDBM50429186
NameBDBM50429186
Synonyms:CHEMBL2336724
TypeSmall organic molecule
Emp. Form.C14H21NO4
Mol. Mass.267.3208
SMILESCC(=O)OC12CC3CC(CC(CC(=O)NO)(C3)C1)C2