Reaction Details
TargetBotulinum neurotoxin type A
LigandBDBM50429187
Substrate/Competitorn/a
Meas. Tech.ChEMBL_943588 (CHEMBL2343855)
IC50 5700±n/a nM
Citation Šilhár, PSilvaggi, NRPellett, SCapková, KJohnson, EAAllen, KNJanda, KD Evaluation of adamantane hydroxamates as botulinum neurotoxin inhibitors: synthesis, crystallography, modeling, kinetic and cellular based studies. Bioorg Med Chem21:1344-8 (2013) 
 
Botulinum neurotoxin type A
Name:Botulinum neurotoxin type A
Type:PROTEIN
Mol. Mass.:149450.01
Organism:Clostridium botulinum
Description:ChEMBL_1510137
Residue:1296
BDBM50429187
NameBDBM50429187
Synonyms:CHEMBL2336723
TypeSmall organic molecule
Emp. Form.C13H21NO3
Mol. Mass.239.3107
SMILESCOC12CC3CC(CC(CC(=O)NO)(C3)C1)C2