Reaction Details
TargetBotulinum neurotoxin type A
LigandBDBM50429188
Substrate/Competitorn/a
Meas. Tech.ChEMBL_943588 (CHEMBL2343855)
IC50 23000±n/a nM
Citation Šilhár, PSilvaggi, NRPellett, SCapková, KJohnson, EAAllen, KNJanda, KD Evaluation of adamantane hydroxamates as botulinum neurotoxin inhibitors: synthesis, crystallography, modeling, kinetic and cellular based studies. Bioorg Med Chem21:1344-8 (2013) 
 
Botulinum neurotoxin type A
Name:Botulinum neurotoxin type A
Type:PROTEIN
Mol. Mass.:149450.01
Organism:Clostridium botulinum
Description:ChEMBL_1510137
Residue:1296
BDBM50429188
NameBDBM50429188
Synonyms:CHEMBL2336722
TypeSmall organic molecule
Emp. Form.C12H19NO3
Mol. Mass.225.2842
SMILESONC(=O)CC12CC3CC(CC(O)(C3)C1)C2