Reaction Details
TargetNitric oxide synthase, brain
LigandBDBM50328814
Substrate/Competitorn/a
Meas. Tech.ChEMBL_946181 (CHEMBL2344060)
Ki 7.0±n/a nM
Citation Li, HXue, FKraus, JMJi, HLabby, KJMataka, JDelker, SLMartásek, PRoman, LJPoulos, TLSilverman, RB Cyclopropyl- and methyl-containing inhibitors of neuronal nitric oxide synthase. Bioorg Med Chem21:1333-43 (2013) 
 
Nitric oxide synthase, brain
Name:Nitric oxide synthase, brain
Type:Enzyme
Mol. Mass.:160570.98
Organism:Rattus norvegicus (rat)
Description:Recombinant nNOS overexpressed in E. coli was used in enzyme assays.
Residue:1429
BDBM50328814
NameBDBM50328814
Synonyms:(+/-)-6-((4-(2-(3-fluorophenethylamino)ethoxy)pyrrolidin-3-yl)methyl)-4-methylpyridin-2-amine 6-{[(3R,4R)-4-(2-{[2-(3-fluorophenyl)ethyl]amino}ethoxy)pyrrolidin-3-yl]methyl}-4-methylpyridin-2-amine CHEMBL1278132 US9212144, 2
TypeSmall organic molecule
Emp. Form.C21H29FN4O
Mol. Mass.372.4796
SMILESCc1cc(N)nc(C[C@@H]2CNC[C@@H]2OCCNCCc2cccc(F)c2)c1