Reaction Details
TargetHeat shock protein HSP 90-alpha
LigandBDBM15359
Substrate/Competitorn/a
Meas. Tech.ChEMBL_943216 (CHEMBL2338980)
Kd 326±n/a nM
Citation Dal Piaz, FVassallo, ATemraz, ACotugno, RBelisario, MABifulco, GChini, MGPisano, CDe Tommasi, NBraca, A A chemical-biological study reveals C9-type iridoids as novel heat shock protein 90 (Hsp90) inhibitors. J Med Chem56:1583-95 (2013) 
 
Heat shock protein HSP 90-alpha
Name:Heat shock protein HSP 90-alpha
Type:Molecular Chaperone
Mol. Mass.:84623.45
Organism:Homo sapiens (Human)
Description:P07900
Residue:732
BDBM15359
NameBDBM15359
Synonyms:(4E,6Z,8S,9S,10E,12S,13R,14S,16R)-13-hydroxy-8,14-dimethoxy-4,10,12,16-tetramethyl-3,20,22-trioxo-19-(prop-2-en-1-ylamino)-2-azabicyclo[16.3.1]docosa-1(21),4,6,10,18-pentaen-9-yl carbamate 17-AAG CHEMBL109480 Tanespimycin
TypeSmall organic molecule
Emp. Form.C31H43N3O8
Mol. Mass.585.6884
SMILESCO[C@H]1C[C@H](C)Cc2c(O)c(NC(=O)C(C)=CC=C[C@H](OC)[C@@H](OC(N)=O)\C(C)=C\[C@H](C)[C@H]1O)cc(O)c2N=CC=C