Reaction Details
TargetAurora kinase B
LigandBDBM50429477
Substrate/Competitorn/a
Meas. Tech.ChEMBL_943668 (CHEMBL2344399)
IC50>10000±n/a nM
Citation Yang, LLLi, GBMa, SZou, CZhou, SSun, QZCheng, CChen, XWang, LJFeng, SLi, LLYang, SY Structure-activity relationship studies of pyrazolo[3,4-d]pyrimidine derivatives leading to the discovery of a novel multikinase inhibitor that potently inhibits FLT3 and VEGFR2 and evaluation of its activity against acute myeloid leukemia in vitro and in vivo. J Med Chem56:1641-55 (2013) 
 
Aurora kinase B
Name:Aurora kinase B
Type:Protein
Mol. Mass.:39327.72
Organism:Homo sapiens (Human)
Description:Q96GD4
Residue:344
BDBM50429477
NameBDBM50429477
Synonyms:CHEMBL2332840
TypeSmall organic molecule
Emp. Form.C19H12ClF3N6O2
Mol. Mass.448.786
SMILESFC(F)(F)c1cc(NC(=O)Nc2ccc(Oc3ncnc4n[nH]cc34)cc2)ccc1Cl