Reaction Details
TargetSterol O-acyltransferase 2
LigandBDBM50429612
Substrate/Competitorn/a
Meas. Tech.ChEMBL_945256 (CHEMBL2339988)
IC50 10.0±n/a nM
Citation Ohtawa, MYamazaki, HOhte, SMatsuda, DOhshiro, TRudel, LLOmura, STomoda, HNagamitsu, T Synthesis and structure-activity relationship of pyripyropene A derivatives as potent and selective acyl-CoA:cholesterol acyltransferase 2 (ACAT2) inhibitors: part 1. Bioorg Med Chem Lett23:1285-7 (2013) 
 
Sterol O-acyltransferase 2
Name:Sterol O-acyltransferase 2
Type:Enzyme
Mol. Mass.:59912.75
Organism:Homo sapiens (Human)
Description:O75908
Residue:522
BDBM50429612
NameBDBM50429612
Synonyms:CHEMBL2334220
TypeSmall organic molecule
Emp. Form.C36H39NO10
Mol. Mass.645.6956
SMILESCC(=O)OC[C@]1(C)[C@H](CC[C@@]2(C)[C@H]1C[C@H](OC(=O)c1ccccc1)[C@@]1(C)Oc3cc(oc(=O)c3[C@H](O)[C@H]21)-c1cccnc1)OC(C)=O