Reaction Details
TargetSterol O-acyltransferase 1
LigandBDBM50429596
Substrate/Competitorn/a
Meas. Tech.ChEMBL_945258 (CHEMBL2339990)
IC50 1170±n/a nM
Citation Ohtawa, MYamazaki, HOhte, SMatsuda, DOhshiro, TRudel, LLOmura, STomoda, HNagamitsu, T Synthesis and structure-activity relationship of pyripyropene A derivatives as potent and selective acyl-CoA:cholesterol acyltransferase 2 (ACAT2) inhibitors: part 1. Bioorg Med Chem Lett23:1285-7 (2013) 
 
Sterol O-acyltransferase 1
Name:Sterol O-acyltransferase 1
Type:Multi-pass membrane protein may form homo- or heterodimers.
Mol. Mass.:64751.94
Organism:Homo sapiens (Human)
Description:P35610
Residue:550
BDBM50429596
NameBDBM50429596
Synonyms:CHEMBL2333813
TypeSmall organic molecule
Emp. Form.C36H38INO10
Mol. Mass.771.5921
SMILESCC(=O)OC[C@]1(C)[C@H](CC[C@@]2(C)[C@H]1C[C@H](OC(=O)c1ccc(I)cc1)[C@@]1(C)Oc3cc(oc(=O)c3[C@H](O)[C@H]21)-c1cccnc1)OC(C)=O