Reaction Details
TargetPlatelet-derived growth factor receptor beta
LigandBDBM50429673
Substrate/Competitorn/a
Meas. Tech.ChEMBL_946706 (CHEMBL2343566)
IC50>500000±n/a nM
Citation Gangjee, ANamjoshi, OAYu, JIhnat, MAThorpe, JEBailey-Downs, LC N2-Trimethylacetyl substituted and unsubstituted-N4-phenylsubstituted-6-(2-pyridin-2-ylethyl)-7H-pyrrolo[2,3-d]pyrimidine-2,4-diamines: design, cellular receptor tyrosine kinase inhibitory activities and in vivo evaluation as antiangiogenic, antimetastatic and antitumor agents. Bioorg Med Chem21:1312-23 (2013) 
 
Platelet-derived growth factor receptor beta
Name:Platelet-derived growth factor receptor beta
Type:Enzyme
Mol. Mass.:123922.25
Organism:Homo sapiens (Human)
Description:P09619
Residue:1106
BDBM50429673
NameBDBM50429673
Synonyms:CHEMBL2335378
TypeSmall organic molecule
Emp. Form.C19H16ClFN6
Mol. Mass.382.822
SMILESNc1nc(Nc2ccc(F)c(Cl)c2)c2cc(CCc3ccccn3)[nH]c2n1