Reaction Details
TargetVascular endothelial growth factor receptor 1
LigandBDBM50429676
Substrate/Competitorn/a
Meas. Tech.ChEMBL_946708 (CHEMBL2343568)
IC50>200000±n/a nM
Citation Gangjee, ANamjoshi, OAYu, JIhnat, MAThorpe, JEBailey-Downs, LC N2-Trimethylacetyl substituted and unsubstituted-N4-phenylsubstituted-6-(2-pyridin-2-ylethyl)-7H-pyrrolo[2,3-d]pyrimidine-2,4-diamines: design, cellular receptor tyrosine kinase inhibitory activities and in vivo evaluation as antiangiogenic, antimetastatic and antitumor agents. Bioorg Med Chem21:1312-23 (2013) 
 
Vascular endothelial growth factor receptor 1
Name:Vascular endothelial growth factor receptor 1
Type:Receptor Tyrosine Kinase
Mol. Mass.:150800.23
Organism:Homo sapiens (Human)
Description:P17948
Residue:1338
BDBM50429676
NameBDBM50429676
Synonyms:CHEMBL2335015
TypeSmall organic molecule
Emp. Form.C24H24BrFN6O
Mol. Mass.511.389
SMILESCC(C)(C)C(=O)Nc1nc(Nc2ccc(F)c(Br)c2)c2cc(CCc3ccccn3)[nH]c2n1