Reaction Details
TargetPlatelet-derived growth factor receptor beta
LigandBDBM50429678
Substrate/Competitorn/a
Meas. Tech.ChEMBL_946706 (CHEMBL2343566)
IC50 331500±n/a nM
Citation Gangjee, ANamjoshi, OAYu, JIhnat, MAThorpe, JEBailey-Downs, LC N2-Trimethylacetyl substituted and unsubstituted-N4-phenylsubstituted-6-(2-pyridin-2-ylethyl)-7H-pyrrolo[2,3-d]pyrimidine-2,4-diamines: design, cellular receptor tyrosine kinase inhibitory activities and in vivo evaluation as antiangiogenic, antimetastatic and antitumor agents. Bioorg Med Chem21:1312-23 (2013) 
 
Platelet-derived growth factor receptor beta
Name:Platelet-derived growth factor receptor beta
Type:Enzyme
Mol. Mass.:123922.25
Organism:Homo sapiens (Human)
Description:P09619
Residue:1106
BDBM50429678
NameBDBM50429678
Synonyms:CHEMBL2335379
TypeSmall organic molecule
Emp. Form.C21H18N6
Mol. Mass.354.4078
SMILESNc1nc(Nc2cccc(c2)C#C)c2cc(CCc3ccccn3)[nH]c2n1