Reaction Details
TargetVascular endothelial growth factor receptor 2
LigandBDBM50429674
Substrate/Competitorn/a
Meas. Tech.ChEMBL_946707 (CHEMBL2343567)
IC50 24100±n/a nM
Citation Gangjee, ANamjoshi, OAYu, JIhnat, MAThorpe, JEBailey-Downs, LC N2-Trimethylacetyl substituted and unsubstituted-N4-phenylsubstituted-6-(2-pyridin-2-ylethyl)-7H-pyrrolo[2,3-d]pyrimidine-2,4-diamines: design, cellular receptor tyrosine kinase inhibitory activities and in vivo evaluation as antiangiogenic, antimetastatic and antitumor agents. Bioorg Med Chem21:1312-23 (2013) 
 
Vascular endothelial growth factor receptor 2
Name:Vascular endothelial growth factor receptor 2
Type:Receptor Tyrosine Kinase
Mol. Mass.:151510.97
Organism:Homo sapiens (Human)
Description:P35968
Residue:1356
BDBM50429674
NameBDBM50429674
Synonyms:CHEMBL2335377
TypeSmall organic molecule
Emp. Form.C19H16BrFN6
Mol. Mass.427.273
SMILESNc1nc(Nc2ccc(F)c(Br)c2)c2cc(CCc3ccccn3)[nH]c2n1