Reaction Details
TargetEpidermal growth factor receptor
LigandBDBM3032
Substrate/Competitorn/a
Meas. Tech.ChEMBL_946709 (CHEMBL2343569)
IC50 230±n/a nM
Citation Gangjee, ANamjoshi, OAYu, JIhnat, MAThorpe, JEBailey-Downs, LC N2-Trimethylacetyl substituted and unsubstituted-N4-phenylsubstituted-6-(2-pyridin-2-ylethyl)-7H-pyrrolo[2,3-d]pyrimidine-2,4-diamines: design, cellular receptor tyrosine kinase inhibitory activities and in vivo evaluation as antiangiogenic, antimetastatic and antitumor agents. Bioorg Med Chem21:1312-23 (2013) 
 
Epidermal growth factor receptor
Name:Epidermal growth factor receptor
Type:Receptor Kinase Domain
Mol. Mass.:134279.59
Organism:Homo sapiens (Human)
Description:P00533
Residue:1210
BDBM3032
NameBDBM3032
Synonyms:CHEMBL1204168 N-(3-bromophenyl)-6,7-dimethoxyquinazolin-4-amine US11001595, Compound PD153035 US9422297, PD153035
TypeSmall organic molecule
Emp. Form.C16H14BrN3O2
Mol. Mass.360.205
SMILESCOc1cc2ncnc(Nc3cccc(Br)c3)c2cc1OC