Reaction Details
TargetSodium-dependent serotonin transporter
LigandBDBM50010859
Substrate/Competitorn/a
Meas. Tech.ChEMBL_942365 (CHEMBL2344277)
IC50 29±n/a nM
Citation Bright, SABrinkø, ALarsen, MTSinning, SWilliams, DCJensen, HH Basic N-interlinked imipramines show apoptotic activity against malignant cells including Burkitt's lymphoma. Bioorg Med Chem Lett23:1220-4 (2013) 
 
Sodium-dependent serotonin transporter
Name:Sodium-dependent serotonin transporter
Type:Multi-pass membrane protein
Mol. Mass.:70322.51
Organism:Homo sapiens (Human)
Description:P31645
Residue:630
BDBM50010859
NameBDBM50010859
Synonyms:CHEMBL11 IMIPRAMINE PAMOATE | Imipramin
TypeSmall organic molecule
Emp. Form.C19H24N2
Mol. Mass.280.4073
SMILESCN(C)CCCN1c2ccccc2CCc2ccccc12