Reaction Details
TargetPhosphatidylinositol 4,5-bisphosphate 3-kinase catalytic subunit alpha isoform
LigandBDBM50429873
Substrate/Competitorn/a
Meas. Tech.ChEMBL_944836 (CHEMBL2342508)
IC50>3000±n/a nM
Citation Takeuchi, CSKim, BGBlazey, CMMa, SJohnson, HWAnand, NKArcalas, ABaik, TGBuhr, CACannoy, JEpshteyn, SJoshi, ALara, KLee, MSWang, LLeahy, JWNuss, JMAay, NAoyama, RFoster, PLee, JLehoux, IMunagala, NPlonowski, ARajan, SWoolfrey, JYamaguchi, KLamb, PMiller, N Discovery of a novel class of highly potent, selective, ATP-competitive, and orally bioavailable inhibitors of the mammalian target of rapamycin (mTOR). J Med Chem56:2218-34 (2013) 
 
Phosphatidylinositol 4,5-bisphosphate 3-kinase catalytic subunit alpha isoform
Name:Phosphatidylinositol 4,5-bisphosphate 3-kinase catalytic subunit alpha isoform
Type:Enzyme Subunit
Mol. Mass.:124294.87
Organism:Homo sapiens (Human)
Description:P42336
Residue:1068
BDBM50429873
NameBDBM50429873
Synonyms:CHEMBL2332925
TypeSmall organic molecule
Emp. Form.C26H25N3O4S
Mol. Mass.475.559
SMILESCCc1cc(ccc1C(=O)N1CCOc2ccc(cc2C1)-c1ccc2nc[nH]c2c1)S(C)(=O)=O