Reaction Details
TargetLysophosphatidic acid receptor 6
LigandBDBM50430006
Substrate/Competitorn/a
Meas. Tech.ChEMBL_946255 (CHEMBL2344993)
EC50 105±n/a nM
Citation Jiang, GInoue, AAoki, JPrestwich, GD Phosphorothioate analogs of sn-2 radyl lysophosphatidic acid (LPA): metabolically stabilized LPA receptor agonists. Bioorg Med Chem Lett23:1865-9 (2013) 
 
Lysophosphatidic acid receptor 6
Name:Lysophosphatidic acid receptor 6
Type:PROTEIN
Mol. Mass.:39408.81
Organism:Homo sapiens (Human)
Description:ChEMBL_946255
Residue:344
BDBM50430006
NameBDBM50430006
Synonyms:CHEMBL2335048
TypeSmall organic molecule
Emp. Form.C22H47O5PS
Mol. Mass.454.644
[C@H](COP(O)(O)=S)OC