Reaction Details
TargetLysophosphatidic acid receptor 4
LigandBDBM50148348
Substrate/Competitorn/a
Meas. Tech.ChEMBL_946257 (CHEMBL2344995)
EC50 8.1±n/a nM
Citation Jiang, GInoue, AAoki, JPrestwich, GD Phosphorothioate analogs of sn-2 radyl lysophosphatidic acid (LPA): metabolically stabilized LPA receptor agonists. Bioorg Med Chem Lett23:1865-9 (2013) 
 
Lysophosphatidic acid receptor 4
Name:Lysophosphatidic acid receptor 4
Type:PROTEIN
Mol. Mass.:41910.31
Organism:Homo sapiens (Human)
Description:ChEMBL_946257
Residue:370
BDBM50148348
NameBDBM50148348
Synonyms:(R)-Octadec-9-enoic acid 2-hydroxy-3-phosphonooxy-propyl ester CHEMBL117021 | lysophosphatidic acid
TypeSmall organic molecule
Emp. Form.C21H41O7P
Mol. Mass.436.5198
SMILESCCCCCCCC\C=C/CCCCCCCC(=O)OC[C@@H](O)COP(O)(O)=O