Reaction Details
TargetLysophosphatidic acid receptor 3
LigandBDBM50381022
Substrate/Competitorn/a
Meas. Tech.ChEMBL_946258 (CHEMBL2344996)
EC50 0.280000±n/a nM
Citation Jiang, GInoue, AAoki, JPrestwich, GD Phosphorothioate analogs of sn-2 radyl lysophosphatidic acid (LPA): metabolically stabilized LPA receptor agonists. Bioorg Med Chem Lett23:1865-9 (2013) 
 
Lysophosphatidic acid receptor 3
Name:Lysophosphatidic acid receptor 3
Type:Enzyme
Mol. Mass.:40149.72
Organism:Homo sapiens (Human)
Description:Q9UBY5
Residue:353
BDBM50381022
NameBDBM50381022
Synonyms:CHEMBL2017139
TypeSmall organic molecule
Emp. Form.C22H45O6PS
Mol. Mass.468.628
(=O)OCC(COP(O)(S)=O)OC