Reaction Details
TargetCytochrome P450 3A4
LigandBDBM50268484
Substrate/Competitorn/a
Meas. Tech.ChEMBL_949160 (CHEMBL2344727)
IC50 6700±n/a nM
Citation Han, XCiviello, RLConway, CMCook, DADavis, CDDegnan, APJiang, XJMacci, RMathias, NRMoench, PPin, SSSchartman, RSignor, LJThalody, GTora, GWhiterock, VXu, CMacor, JEDubowchik, GM The synthesis and SAR of calcitonin gene-related peptide (CGRP) receptor antagonists derived from tyrosine surrogates. Part 2. Bioorg Med Chem Lett23:1870-3 (2013) 
 
Cytochrome P450 3A4
Name:Cytochrome P450 3A4
Type:Enzyme
Mol. Mass.:57349.57
Organism:Homo sapiens (Human)
Description:n/a
Residue:503
BDBM50268484
NameBDBM50268484
Synonyms:(R)-4-(8-Fluoro-2-oxo-1,2-dihydroquinazolin-3(4H)-yl)-N-(3-(7-methyl-1H-indazol-5-yl)-1-oxo-1-(4-(piperidin-1-yl)piperidin-1-yl)propan-2-yl)piperidine-1-carboxamide BMS-694153 | CHEMBL450668
TypeSmall organic molecule
Emp. Form.C35H45FN8O3
Mol. Mass.644.782
SMILESCc1cc(C[C@@H](NC(=O)N2CCC(CC2)N2Cc3cccc(F)c3NC2=O)C(=O)N2CCC(CC2)N2CCCCC2)cc2cn[nH]c12