Reaction Details
TargetCalcitonin gene-related peptide type 1 receptor
LigandBDBM50430059
Substrate/Competitorn/a
Meas. Tech.ChEMBL_949161 (CHEMBL2344728)
Ki 0.048000±n/a nM
Citation Han, XCiviello, RLConway, CMCook, DADavis, CDDegnan, APJiang, XJMacci, RMathias, NRMoench, PPin, SSSchartman, RSignor, LJThalody, GTora, GWhiterock, VXu, CMacor, JEDubowchik, GM The synthesis and SAR of calcitonin gene-related peptide (CGRP) receptor antagonists derived from tyrosine surrogates. Part 2. Bioorg Med Chem Lett23:1870-3 (2013) 
 
Calcitonin gene-related peptide type 1 receptor
Name:Calcitonin gene-related peptide type 1 receptor
Type:Enzyme Catalytic Domain
Mol. Mass.:52980.45
Organism:Homo sapiens (Human)
Description:Q16602
Residue:461
BDBM50430059
NameBDBM50430059
Synonyms:CHEMBL2336419
TypeSmall organic molecule
Emp. Form.C37H50N8O3
Mol. Mass.654.8447
SMILESCCc1cc(CC(NC(=O)N2CCC(CC2)N2Cc3ccccc3NC2=O)C(=O)N2CCC(CC2)N2CCCCC2)cc2c(C)n[nH]c12