Reaction Details
TargetTransmembrane protease serine 4
LigandBDBM50430195
Substrate/Competitorn/a
Meas. Tech.ChEMBL_942945 (CHEMBL2343323)
IC50 12000±n/a nM
Citation Kang, SMin, HJKang, MSJung, MGKim, S Discovery of novel 2-hydroxydiarylamide derivatives as TMPRSS4 inhibitors. Bioorg Med Chem Lett23:1748-51 (2013) 
 
Transmembrane protease serine 4
Name:Transmembrane protease serine 4
Type:PROTEIN
Mol. Mass.:48237.89
Organism:Homo sapiens (Human)
Description:ChEMBL_942945
Residue:437
BDBM50430195
NameBDBM50430195
Synonyms:CHEMBL2338696
TypeSmall organic molecule
Emp. Form.C15H8ClF6NO2
Mol. Mass.383.673
SMILESOc1cc(Cl)ccc1C(=O)Nc1cc(cc(c1)C(F)(F)F)C(F)(F)F