Reaction Details
TargetCarbonic anhydrase 9
LigandBDBM50430540
Substrate/Competitorn/a
Meas. Tech.ChEMBL_946751 (CHEMBL2344100)
IC50 28±n/a nM
Citation Gao, RLiao, SZhang, CZhu, WWang, LHuang, JZhao, ZLi, HQian, XXu, Y Optimization of heterocyclic substituted benzenesulfonamides as novel carbonic anhydrase IX inhibitors and their structure activity relationship. Eur J Med Chem62:597-604 (2013) 
 
Carbonic anhydrase 9
Name:Carbonic anhydrase 9
Type:Enzyme
Mol. Mass.:49669.03
Organism:Homo sapiens (Human)
Description:Catalytic domain of human cloned isozyme was used in the assay
Residue:459
BDBM50430540
NameBDBM50430540
Synonyms:CHEMBL2336902
TypeSmall organic molecule
Emp. Form.C20H17N5O2S
Mol. Mass.391.446
SMILESNc1ccc(Nc2nnc(-c3cccc(c3)S(N)(=O)=O)c3ccccc23)cc1