Reaction Details
TargetPlatelet-derived growth factor receptor beta
LigandBDBM50430569
Substrate/Competitorn/a
Meas. Tech.ChEMBL_946791 (CHEMBL2344595)
IC50>200000±n/a nM
Citation Gangjee, AZaware, NRaghavan, SDisch, BCThorpe, JEBastian, AIhnat, MA Synthesis and biological activity of 5-chloro-N4-substituted phenyl-9H-pyrimido[4,5-b]indole-2,4-diamines as vascular endothelial growth factor receptor-2 inhibitors and antiangiogenic agents. Bioorg Med Chem21:1857-64 (2013) 
 
Platelet-derived growth factor receptor beta
Name:Platelet-derived growth factor receptor beta
Type:Enzyme
Mol. Mass.:123922.25
Organism:Homo sapiens (Human)
Description:P09619
Residue:1106
BDBM50430569
NameBDBM50430569
Synonyms:CHEMBL2337364
TypeSmall organic molecule
Emp. Form.C16H10Cl2FN5
Mol. Mass.362.189
SMILESNc1nc(Nc2ccc(Cl)cc2F)c2c(n1)[nH]c1cccc(Cl)c21