Reaction Details
TargetVascular endothelial growth factor receptor 2
LigandBDBM50430571
Substrate/Competitorn/a
Meas. Tech.ChEMBL_946793 (CHEMBL2344597)
IC50 30300±n/a nM
Citation Gangjee, AZaware, NRaghavan, SDisch, BCThorpe, JEBastian, AIhnat, MA Synthesis and biological activity of 5-chloro-N4-substituted phenyl-9H-pyrimido[4,5-b]indole-2,4-diamines as vascular endothelial growth factor receptor-2 inhibitors and antiangiogenic agents. Bioorg Med Chem21:1857-64 (2013) 
 
Vascular endothelial growth factor receptor 2
Name:Vascular endothelial growth factor receptor 2
Type:Receptor Tyrosine Kinase
Mol. Mass.:151510.97
Organism:Homo sapiens (Human)
Description:P35968
Residue:1356
BDBM50430571
NameBDBM50430571
Synonyms:CHEMBL2337362
TypeSmall organic molecule
Emp. Form.C19H18ClN5
Mol. Mass.351.833
SMILESCC(C)c1ccc(Nc2nc(N)nc3[nH]c4cccc(Cl)c4c23)cc1