Reaction Details
TargetAndrogen receptor
LigandBDBM50430749
Substrate/Competitorn/a
Meas. Tech.ChEMBL_942992 (CHEMBL2343828)
IC50 113±n/a nM
Citation Nakamura, MMakishima, MHashimoto, Y Development of silicon-containing bis-phenol derivatives as androgen receptor antagonists: selectivity switching by C/Si exchange. Bioorg Med Chem21:1643-51 (2013) 
 
Androgen receptor
Name:Androgen receptor
Type:PROTEIN
Mol. Mass.:98196.62
Organism:Mus musculus
Description:ChEMBL_945930
Residue:899
BDBM50430749
NameBDBM50430749
Synonyms:CHEMBL2334724
TypeSmall organic molecule
Emp. Form.C27H40O5Si
Mol. Mass.472.689
SMILESCC[Si](CC)(c1ccc(OC[C@H](O)CO)c(C)c1)c1ccc(OCC(=O)C(C)(C)C)c(C)c1