Reaction Details
TargetCytochrome P450 3A4
LigandBDBM50430792
Substrate/Competitorn/a
Meas. Tech.ChEMBL_943410 (CHEMBL2341374)
IC50 7300±n/a nM
Citation Estrada, AAShore, DGBlackwood, EChen, YHDeshmukh, GDing, XDipasquale, AGEpler, JAFriedman, LSKoehler, MFLiu, LMalek, SNonomiya, JOrtwine, DFPei, ZSideris, SSt-Jean, FTrinh, LTruong, TLyssikatos, JP Pyrimidoaminotropanes as potent, selective, and efficacious small molecule kinase inhibitors of the mammalian target of rapamycin (mTOR). J Med Chem56:3090-101 (2013) 
 
Cytochrome P450 3A4
Name:Cytochrome P450 3A4
Type:Enzyme
Mol. Mass.:57349.57
Organism:Homo sapiens (Human)
Description:n/a
Residue:503
BDBM50430792
NameBDBM50430792
Synonyms:CHEMBL2334759
TypeSmall organic molecule
Emp. Form.C25H32N6O3
Mol. Mass.464.56
SMILESCCNC(=O)Nc1ccc(cc1)-c1nc2C[C@@H]3CC[C@@H](N3C(C)=O)c2c(n1)N1CCOC[C@@H]1C