Reaction Details
TargetSerine/threonine-protein kinase mTOR
LigandBDBM50430797
Substrate/Competitorn/a
Meas. Tech.ChEMBL_943417 (CHEMBL2341381)
Ki 4.2±n/a nM
Citation Estrada, AAShore, DGBlackwood, EChen, YHDeshmukh, GDing, XDipasquale, AGEpler, JAFriedman, LSKoehler, MFLiu, LMalek, SNonomiya, JOrtwine, DFPei, ZSideris, SSt-Jean, FTrinh, LTruong, TLyssikatos, JP Pyrimidoaminotropanes as potent, selective, and efficacious small molecule kinase inhibitors of the mammalian target of rapamycin (mTOR). J Med Chem56:3090-101 (2013) 
 
Serine/threonine-protein kinase mTOR
Name:Serine/threonine-protein kinase mTOR
Type:Rapamycin target protein
Mol. Mass.:288917.12
Organism:Homo sapiens (Human)
Description:P42345
Residue:2549
BDBM50430797
NameBDBM50430797
Synonyms:CHEMBL2334753
TypeSmall organic molecule
Emp. Form.C24H32N6O2
Mol. Mass.436.5499
SMILESCCNC(=O)Nc1ccc(cc1)-c1nc2C[C@@H]3CC[C@@H](N3C)c2c(n1)N1CCOC[C@@H]1C