Reaction Details
TargetTranslocator protein
LigandBDBM50430876
Substrate/Competitorn/a
Meas. Tech.ChEMBL_945907 (CHEMBL2340521)
Ki 55±n/a nM
Citation Tang, DMcKinley, ETHight, MRUddin, MIHarp, JMFu, ANickels, MLBuck, JRManning, HC Synthesis and structure-activity relationships of 5,6,7-substituted pyrazolopyrimidines: discovery of a novel TSPO PET ligand for cancer imaging. J Med Chem56:3429-33 (2013) 
 
Translocator protein
Name:Translocator protein
Type:Mitochondrion membrane protein
Mol. Mass.:18945.84
Organism:Rattus norvegicus (rat)
Description:Competitive binding experiments were performed on rat kidney mitochondrial membranes.
Residue:169
BDBM50430876
NameBDBM50430876
Synonyms:CHEMBL2336473
TypeSmall organic molecule
Emp. Form.C21H25ClN4O2
Mol. Mass.400.902
SMILESCCN(CC)C(=O)Cc1c(nn2c(C)c(Cl)c(C)nc12)-c1ccc(OC)cc1