Reaction Details
TargetTranslocator protein
LigandBDBM50430878
Substrate/Competitorn/a
Meas. Tech.ChEMBL_945907 (CHEMBL2340521)
Ki 0.27±n/a nM
Citation Tang, DMcKinley, ETHight, MRUddin, MIHarp, JMFu, ANickels, MLBuck, JRManning, HC Synthesis and structure-activity relationships of 5,6,7-substituted pyrazolopyrimidines: discovery of a novel TSPO PET ligand for cancer imaging. J Med Chem56:3429-33 (2013) 
 
Translocator protein
Name:Translocator protein
Type:Mitochondrion membrane protein
Mol. Mass.:18945.84
Organism:Rattus norvegicus (rat)
Description:Competitive binding experiments were performed on rat kidney mitochondrial membranes.
Residue:169
BDBM50430878
NameBDBM50430878
Synonyms:CHEMBL2336474
TypeSmall organic molecule
Emp. Form.C24H31FN4O2
Mol. Mass.426.5269
SMILESCCN(CC)C(=O)Cc1c(nn2c(CC)cc(CC)nc12)-c1ccc(OCCF)cc1